{"text_format":"1","workbook":"xlsx","n_sheets":16,"sheets":["0","1","2","3","4","5","6","7","8","9","10","11","12","FRONT","BACK","PIC"],"not_rendered":{"charts":0,"images":2,"macros":1,"external_links":0,"defined_names":15,"comments":0,"pivot_tables":0},"unopened":[],"bounds":{"document_bytes":16777216,"sheet_cells":100000,"rows_first":2000,"rows_last":500,"rows_between":2000,"halvings":0,"cell_chars":16384,"cell_head_chars":4096},"cells_cut":0,"cells_raw":0,"read":"whole","date_system":"1900"}

{"sheet":"0","index":0,"n_rows":61,"n_cols":7,"rows_kept":61,"cut":false,"hidden":false,"merged":[[2,0,2,5],[44,0,44,1],[0,0,0,5],[1,0,1,5],[13,3,13,7]]}
["STEP 1 - SHEET 0 Fill items in BLUE to be placed on the ID Cards."]
["STEP 2 - SHEET 1-12 Add the coach and player pictures for each card."]
["STEP 3 - CLICK THE BUTTON\nAfter entering the data and pasting coach / player photos, click the button below to create JPG and PNG image files of each of the coach and player cards. Sheets 1-12 are sized to be printed on 4x6 photo. It will create files 1.jpg thru 12.jpg, and 1.png thru 12.png. Take the images files to a place like Walgreens or Rite-Aid to print on 4x6 photo. You only need to user either the JPG or PNG files, not both. Do not delete or change the names of any of the worksheets (code behind button will not work then). A line up card is included with the information provided. A little oversized (print on 8-1/2 x 11), but is usable."]
["REGION NUMBER","1234"]
["TEAM NAME:","TEAM NAME"]
["DIVISION:",1]
["GENDER:",1]
["AYSO SEASON:","MY2015"]
["REGIONAL COMMISSIONER","COMMISSIONER NAME"]
["DATE OF 1ST DAY OF TOURNAMENT","2016-06-19"]
[null,null,"AYSO\nID","COACH\nCERTIFICATION","CERTIFICATION\nDATE","SAFE HAVEN\nDATE","CONCUSSION\nDATE"]
["HEAD COACH NAME:","HEAD COACH","12345678",3,"2014-03-10","2013-06-12","2012-07-13"]
["ASST. COACH NAME:","ASST COACH","23456789",1,"2008-03-11","2000-08-07","1999-12-25"]
[null,null,null,"Select the required coach level certification that you're certified for, of the team you're coaching. Do not the highest level you've achieved if different than the team requirement."]
[]
["PLAYER NAME","JERSEY\nNUMBER","AYSO\nID","DATE\nOF BIRTH","AGE"]
["PLAYER 1","2","11122233","1995-01-01",{"$f":"IF(A17<>\"\", INT(YEARFRAC($D17,$B$10)),\"\")","v":21}]
["PLAYER 2","3",11122244,"1996-01-02",{"$f":"IF(A18<>\"\", INT(YEARFRAC($D18,$B$10)),\"\")","v":20}]
["PLAYER 3","4",11122255,"1997-01-03",19]
["PLAYER 4","5",11122266,"1998-01-04",18]
["PLAYER 5","6",11122277,"1999-01-05",17]
["PLAYER 6","7",11122288,"2000-01-06",16]
["PLAYER 7","8",11122299,"2001-01-07",15]
["PLAYER 8","9",11122310,"2002-01-08",14]
["PLAYER 9","10",11122321,"2003-01-09",13]
["PLAYER 10","11",11122332,"2004-01-10",12]
["PLAYER 11","12",11122343,"2005-01-11",11]
["PLAYER 12","13",11122354,"2006-01-12",10]
["PLAYER 13","14",11122365,"2007-01-13",9]
["PLAYER 14","15",11122376,"2008-01-14",8]
["PLAYER 15","16",11122387,"2009-01-15",7]
["PLAYER 16","17",11122398,"2010-01-16",6]
["PLAYER 17","18",11122409,"2011-01-17",5]
["PLAYER 18","19",11122420,"2012-01-18",4]
["PLAYER 19","20",11122431,"2013-01-19",3]
["PLAYER 20","21",11122442,"2014-01-20",2]
["PLAYER 21","22",11122453,"2015-01-21",1]
["PLAYER 22","23",11122464,"2016-01-22",0]
[]
[]
[]
[]
[]
[]
["DO NOT MODIFY THIS AREA"]
["U8 COACH"]
["U10 COACH"]
["U12 COACH"]
["INTERMEDIATE"]
["ADVANCED"]
["NATIONAL"]
["U8"]
["U10"]
["U12"]
["U14"]
["U16"]
["U19"]
[]
["BOYS"]
["GIRLS"]
["COED"]

{"sheet":"1","index":1,"n_rows":30,"n_cols":11,"rows_kept":30,"cut":false,"hidden":false,"merged":[[19,7,27,7],[4,7,12,7],[28,2,28,7],[2,2,2,7],[3,2,3,4],[4,2,4,4],[5,2,5,4],[7,2,7,3],[3,5,3,7],[10,2,10,4],[25,2,25,4],[8,2,8,3],[8,6,12,6],[9,2,9,3],[29,2,29,7],[4,5,12,5],[19,5,27,5],[23,6,27,6],[24,2,24,3],[13,2,13,7],[14,2,14,7],[17,2,17,7],[18,2,18,4],[19,2,19,4],[20,2,20,4],[18,5,18,7],[26,2,27,4],[11,2,12,4],[22,2,22,3],[23,2,23,3]]}
[]
[]
[]
[null,null,"AYSO SECTION 8 AREA C",null,null,{"$f":"'0'!$B$5","v":"TEAM NAME"}]
[null,null,"ASSISTANT COACH NAME",null,null,"INSERT OR PASTE\nPICTURE HERE",null,{"$f":"'0'!$B$4","v":"1234"}]
[null,null,{"$f":"IF('0'!$B$12<>\"\",'0'!$B$12,\"\")","v":"HEAD COACH"}]
[null,null,"AYSO VOLUNTEER ID#",null,"CONCUSSION"]
[null,null,{"$f":"IF('0'!$C$12<>\"\",'0'!$C$12,\"\")","v":"12345678"},null,{"$f":"'0'!G12","v":"2012-07-13"}]
[null,null,"CERTIFICATION",null,"SAFE HAVEN",null,"REGION"]
[null,null,{"$f":"'0'!E12","v":"2014-03-10"},null,{"$f":"'0'!F12","v":"2013-06-12"}]
[null,null,{"$f":"CHOOSE('0'!$B$6,\"U8\", \"U10\", \"U12\", \"U14\",\"U16\", \"U19\") & \" \" & CHOOSE('0'!$B$7,\"BOYS\",\"GIRLS\",\"COED\")","v":"U8 BOYS"},null,null,null,null,null,null,null,{"$f":"'0'!$B$6","v":1}]
[null,null,{"$f":"CHOOSE('0'!$D$12,\"U8 COACH\",\"U10 COACH\",\"U12 COACH\",\"INTERMEDIATE\",\"ADVANCED\",\"NATIONAL\")","v":"U12 COACH"}]
[null,null,null,null,null,null,null,null,null,null,{"$f":"'0'!D12","v":3}]
[null,null,"REGIONAL COMMISSIONER - SIGNATURE WITH RED INK"]
[null,null,{"$f":"'0'!$B$9","v":"COMMISSIONER NAME"}]
[]
[]
[]
[null,null,"AYSO SECTION 8 AREA C",null,null,{"$f":"'0'!$B$5","v":"TEAM NAME"}]
[null,null,"ASSISTANT COACH NAME",null,null,"INSERT OR PASTE\nPICTURE HERE",null,{"$f":"'0'!$B$4","v":"1234"}]
[null,null,{"$f":"IF('0'!$B$13<>\"\",'0'!$B$13,\"\")","v":"ASST COACH"}]
[null,null,"AYSO VOLUNTEER ID#",null,"CONCUSSION"]
[null,null,{"$f":"IF('0'!$C$13<>\"\",'0'!$C$13,\"\")","v":"23456789"},null,{"$f":"'0'!G13","v":"1999-12-25"}]
[null,null,"CERTIFICATION",null,"SAFE HAVEN",null,"REGION"]
[null,null,{"$f":"'0'!E13","v":"2008-03-11"},null,{"$f":"'0'!F13","v":"2000-08-07"}]
[null,null,{"$f":"CHOOSE('0'!$B$6,\"U8\", \"U10\", \"U12\", \"U14\",\"U16\", \"U19\") & \" \" & CHOOSE('0'!$B$7,\"BOYS\",\"GIRLS\",\"COED\")","v":"U8 BOYS"},null,null,null,null,null,null,null,{"$f":"'0'!$B$6","v":1}]
[null,null,{"$f":"CHOOSE('0'!$D$13,\"U8 COACH\",\"U10 COACH\",\"U12 COACH\",\"INTERMEDIATE\",\"ADVANCED\",\"NATIONAL\")","v":"U8 COACH"}]
[null,null,null,null,null,null,null,null,null,null,{"$f":"'0'!D13","v":1}]
[null,null,"REGIONAL COMMISSIONER - SIGNATURE WITH RED INK"]
[null,null,{"$f":"'0'!$B$9","v":"COMMISSIONER NAME"}]

{"sheet":"2","index":2,"n_rows":30,"n_cols":11,"rows_kept":30,"cut":false,"hidden":false,"merged":[[9,2,9,3],[8,2,8,3],[18,5,18,7],[19,7,27,7],[10,2,10,4],[25,2,25,4],[20,2,20,4],[22,2,22,3],[13,2,13,7],[17,2,17,7],[18,2,18,4],[2,2,2,7],[3,2,3,4],[4,2,4,4],[5,2,5,4],[7,2,7,3],[3,5,3,7],[6,2,6,3],[29,2,29,7],[4,5,12,5],[12,2,12,4],[27,2,27,4],[19,5,27,5],[28,2,28,7],[23,2,23,3],[23,6,27,6],[24,2,24,3],[26,2,26,4],[11,2,11,4],[4,7,12,7],[14,2,14,7],[19,2,19,4],[8,6,12,6],[21,2,21,3]]}
[]
[]
[]
[null,null,"AYSO SECTION 8 AREA C",null,null,{"$f":"'0'!$B$5","v":"TEAM NAME"}]
[null,null,"PLAYER NAME",null,null,"INSERT OR PASTE\nPICTURE HERE",null,{"$f":"'0'!$B$4","v":"1234"}]
[null,null,{"$f":"IF('0'!$A$17<>\"\",'0'!$A$17,\"\")","v":"PLAYER 1"}]
[null,null,"AYSO PLAYER ID#:",null,{"$f":"IF(E8<>\"\",\"JERSEY #\",\"\")","v":"JERSEY #"}]
[null,null,{"$f":"IF('0'!$C$17<>\"\",'0'!$C$17,\"\")","v":"11122233"},null,{"$f":"IF('0'!$B$17<>\"\",'0'!$B$17,\"\")","v":"2"}]
[null,null,"DATE OF BIRTH:",null,"AGE",null,"REGION"]
[null,null,{"$f":"IF('0'!$D$17<>\"\",'0'!$D$17,\"\")","v":"1995-01-01"},null,{"$f":"IF('0'!$E$17<>\"\",'0'!$E$17,\"\")","v":21}]
[null,null,{"$f":"CHOOSE('0'!$B$6,\"U8\", \"U10\", \"U12\", \"U14\",\"U16\", \"U19\") & \" \" & CHOOSE('0'!$B$7,\"BOYS\",\"GIRLS\",\"COED\")","v":"U8 BOYS"},null,null,null,null,null,null,null,{"$f":"'0'!$B$6","v":1}]
[null,null,"AYSO SEASON:"]
[null,null,{"$f":"'0'!$B$8","v":"MY2015"}]
[null,null,"REGIONAL COMMISSIONER - SIGNATURE WITH RED INK"]
[null,null,{"$f":"'0'!$B$9","v":"COMMISSIONER NAME"}]
[]
[]
[]
[null,null,"AYSO SECTION 8 AREA C",null,null,{"$f":"'0'!$B$5","v":"TEAM NAME"}]
[null,null,"PLAYER NAME",null,null,"INSERT OR PASTE\nPICTURE HERE",null,{"$f":"'0'!$B$4","v":"1234"}]
[null,null,{"$f":"IF('0'!$A$18<>\"\",'0'!$A$18,\"\")","v":"PLAYER 2"}]
[null,null,"AYSO PLAYER ID#:",null,{"$f":"IF(E23<>\"\",\"JERSEY #\",\"\")","v":"JERSEY #"}]
[null,null,{"$f":"IF('0'!$C$18<>\"\",'0'!$C$18,\"\")","v":11122244},null,{"$f":"IF('0'!$B$18<>\"\",'0'!$B$18,\"\")","v":"3"}]
[null,null,"DATE OF BIRTH:",null,"AGE",null,"REGION"]
[null,null,{"$f":"IF('0'!$D$18<>\"\",'0'!$D$18,\"\")","v":"1996-01-02"},null,{"$f":"IF('0'!$E$18<>\"\",'0'!$E$18,\"\")","v":20}]
[null,null,{"$f":"CHOOSE('0'!$B$6,\"U8\", \"U10\", \"U12\", \"U14\",\"U16\", \"U19\") & \" \" & CHOOSE('0'!$B$7,\"BOYS\",\"GIRLS\",\"COED\")","v":"U8 BOYS"},null,null,null,null,null,null,null,{"$f":"'0'!$B$6","v":1}]
[null,null,"AYSO SEASON:"]
[null,null,{"$f":"'0'!$B$8","v":"MY2015"}]
[null,null,"REGIONAL COMMISSIONER - SIGNATURE WITH RED INK"]
[null,null,{"$f":"'0'!$B$9","v":"COMMISSIONER NAME"}]

{"sheet":"3","index":3,"n_rows":30,"n_cols":11,"rows_kept":30,"cut":false,"hidden":false,"merged":[[9,2,9,3],[8,2,8,3],[18,5,18,7],[19,7,27,7],[10,2,10,4],[25,2,25,4],[20,2,20,4],[22,2,22,3],[13,2,13,7],[17,2,17,7],[18,2,18,4],[2,2,2,7],[3,2,3,4],[4,2,4,4],[5,2,5,4],[7,2,7,3],[3,5,3,7],[6,2,6,3],[29,2,29,7],[4,5,12,5],[12,2,12,4],[27,2,27,4],[19,5,27,5],[28,2,28,7],[23,2,23,3],[23,6,27,6],[24,2,24,3],[26,2,26,4],[11,2,11,4],[4,7,12,7],[14,2,14,7],[19,2,19,4],[8,6,12,6],[21,2,21,3]]}
[]
[]
[]
[null,null,"AYSO SECTION 8 AREA C",null,null,{"$f":"'0'!$B$5","v":"TEAM NAME"}]
[null,null,"PLAYER NAME",null,null,"INSERT OR PASTE\nPICTURE HERE",null,{"$f":"'0'!$B$4","v":"1234"}]
[null,null,{"$f":"IF('0'!$A$19<>\"\",'0'!$A$19,\"\")","v":"PLAYER 3"}]
[null,null,"AYSO PLAYER ID#:",null,{"$f":"IF(E8<>\"\",\"JERSEY #\",\"\")","v":"JERSEY #"}]
[null,null,{"$f":"IF('0'!$C$19<>\"\",'0'!$C$19,\"\")","v":11122255},null,{"$f":"IF('0'!$B$19<>\"\",'0'!$B$19,\"\")","v":"4"}]
[null,null,"DATE OF BIRTH:",null,"AGE",null,"REGION"]
[null,null,{"$f":"IF('0'!$D$19<>\"\",'0'!$D$19,\"\")","v":"1997-01-03"},null,{"$f":"IF('0'!$E$19<>\"\",'0'!$E$19,\"\")","v":19}]
[null,null,{"$f":"CHOOSE('0'!$B$6,\"U8\", \"U10\", \"U12\", \"U14\",\"U16\", \"U19\") & \" \" & CHOOSE('0'!$B$7,\"BOYS\",\"GIRLS\",\"COED\")","v":"U8 BOYS"},null,null,null,null,null,null,null,{"$f":"'0'!$B$6","v":1}]
[null,null,"AYSO SEASON:"]
[null,null,{"$f":"'0'!$B$8","v":"MY2015"}]
[null,null,"REGIONAL COMMISSIONER - SIGNATURE WITH RED INK"]
[null,null,{"$f":"'0'!$B$9","v":"COMMISSIONER NAME"}]
[]
[]
[]
[null,null,"AYSO SECTION 8 AREA C",null,null,{"$f":"'0'!$B$5","v":"TEAM NAME"}]
[null,null,"PLAYER NAME",null,null,"INSERT OR PASTE\nPICTURE HERE",null,{"$f":"'0'!$B$4","v":"1234"}]
[null,null,{"$f":"IF('0'!$A$20<>\"\",'0'!$A$20,\"\")","v":"PLAYER 4"}]
[null,null,"AYSO PLAYER ID#:",null,{"$f":"IF(E23<>\"\",\"JERSEY #\",\"\")","v":"JERSEY #"}]
[null,null,{"$f":"IF('0'!$C$20<>\"\",'0'!$C$20,\"\")","v":11122266},null,{"$f":"IF('0'!$B$20<>\"\",'0'!$B$20,\"\")","v":"5"}]
[null,null,"DATE OF BIRTH:",null,"AGE",null,"REGION"]
[null,null,{"$f":"IF('0'!$D$20<>\"\",'0'!$D$20,\"\")","v":"1998-01-04"},null,{"$f":"IF('0'!$E$20<>\"\",'0'!$E$20,\"\")","v":18}]
[null,null,{"$f":"CHOOSE('0'!$B$6,\"U8\", \"U10\", \"U12\", \"U14\",\"U16\", \"U19\") & \" \" & CHOOSE('0'!$B$7,\"BOYS\",\"GIRLS\",\"COED\")","v":"U8 BOYS"},null,null,null,null,null,null,null,{"$f":"'0'!$B$6","v":1}]
[null,null,"AYSO SEASON:"]
[null,null,{"$f":"'0'!$B$8","v":"MY2015"}]
[null,null,"REGIONAL COMMISSIONER - SIGNATURE WITH RED INK"]
[null,null,{"$f":"'0'!$B$9","v":"COMMISSIONER NAME"}]

{"sheet":"4","index":4,"n_rows":30,"n_cols":11,"rows_kept":30,"cut":false,"hidden":false,"merged":[[9,2,9,3],[8,2,8,3],[18,5,18,7],[19,7,27,7],[10,2,10,4],[25,2,25,4],[20,2,20,4],[22,2,22,3],[13,2,13,7],[17,2,17,7],[18,2,18,4],[2,2,2,7],[3,2,3,4],[4,2,4,4],[5,2,5,4],[7,2,7,3],[3,5,3,7],[6,2,6,3],[29,2,29,7],[4,5,12,5],[12,2,12,4],[27,2,27,4],[19,5,27,5],[28,2,28,7],[23,2,23,3],[23,6,27,6],[24,2,24,3],[26,2,26,4],[11,2,11,4],[4,7,12,7],[14,2,14,7],[19,2,19,4],[8,6,12,6],[21,2,21,3]]}
[]
[]
[]
[null,null,"AYSO SECTION 8 AREA C",null,null,{"$f":"'0'!$B$5","v":"TEAM NAME"}]
[null,null,"PLAYER NAME",null,null,"INSERT OR PASTE\nPICTURE HERE",null,{"$f":"'0'!$B$4","v":"1234"}]
[null,null,{"$f":"IF('0'!$A$21<>\"\",'0'!$A$21,\"\")","v":"PLAYER 5"}]
[null,null,"AYSO PLAYER ID#:",null,{"$f":"IF(E8<>\"\",\"JERSEY #\",\"\")","v":"JERSEY #"}]
[null,null,{"$f":"IF('0'!$C$21<>\"\",'0'!$C$21,\"\")","v":11122277},null,{"$f":"IF('0'!$B$21<>\"\",'0'!$B$21,\"\")","v":"6"}]
[null,null,"DATE OF BIRTH:",null,"AGE",null,"REGION"]
[null,null,{"$f":"IF('0'!$D$21<>\"\",'0'!$D$21,\"\")","v":"1999-01-05"},null,{"$f":"IF('0'!$E$21<>\"\",'0'!$E$21,\"\")","v":17}]
[null,null,{"$f":"CHOOSE('0'!$B$6,\"U8\", \"U10\", \"U12\", \"U14\",\"U16\", \"U19\") & \" \" & CHOOSE('0'!$B$7,\"BOYS\",\"GIRLS\",\"COED\")","v":"U8 BOYS"},null,null,null,null,null,null,null,{"$f":"'0'!$B$6","v":1}]
[null,null,"AYSO SEASON:"]
[null,null,{"$f":"'0'!$B$8","v":"MY2015"}]
[null,null,"REGIONAL COMMISSIONER - SIGNATURE WITH RED INK"]
[null,null,{"$f":"'0'!$B$9","v":"COMMISSIONER NAME"}]
[]
[]
[]
[null,null,"AYSO SECTION 8 AREA C",null,null,{"$f":"'0'!$B$5","v":"TEAM NAME"}]
[null,null,"PLAYER NAME",null,null,"INSERT OR PASTE\nPICTURE HERE",null,{"$f":"'0'!$B$4","v":"1234"}]
[null,null,{"$f":"IF('0'!$A$22<>\"\",'0'!$A$22,\"\")","v":"PLAYER 6"}]
[null,null,"AYSO PLAYER ID#:",null,{"$f":"IF(E23<>\"\",\"JERSEY #\",\"\")","v":"JERSEY #"}]
[null,null,{"$f":"IF('0'!$C$22<>\"\",'0'!$C$22,\"\")","v":11122288},null,{"$f":"IF('0'!$B$22<>\"\",'0'!$B$22,\"\")","v":"7"}]
[null,null,"DATE OF BIRTH:",null,"AGE",null,"REGION"]
[null,null,{"$f":"IF('0'!$D$22<>\"\",'0'!$D$22,\"\")","v":"2000-01-06"},null,{"$f":"IF('0'!$E$22<>\"\",'0'!$E$22,\"\")","v":16}]
[null,null,{"$f":"CHOOSE('0'!$B$6,\"U8\", \"U10\", \"U12\", \"U14\",\"U16\", \"U19\") & \" \" & CHOOSE('0'!$B$7,\"BOYS\",\"GIRLS\",\"COED\")","v":"U8 BOYS"},null,null,null,null,null,null,null,{"$f":"'0'!$B$6","v":1}]
[null,null,"AYSO SEASON:"]
[null,null,{"$f":"'0'!$B$8","v":"MY2015"}]
[null,null,"REGIONAL COMMISSIONER - SIGNATURE WITH RED INK"]
[null,null,{"$f":"'0'!$B$9","v":"COMMISSIONER NAME"}]

{"sheet":"5","index":5,"n_rows":30,"n_cols":11,"rows_kept":30,"cut":false,"hidden":false,"merged":[[9,2,9,3],[8,2,8,3],[18,5,18,7],[19,7,27,7],[10,2,10,4],[25,2,25,4],[20,2,20,4],[22,2,22,3],[13,2,13,7],[17,2,17,7],[18,2,18,4],[2,2,2,7],[3,2,3,4],[4,2,4,4],[5,2,5,4],[7,2,7,3],[3,5,3,7],[6,2,6,3],[29,2,29,7],[4,5,12,5],[12,2,12,4],[27,2,27,4],[19,5,27,5],[28,2,28,7],[23,2,23,3],[23,6,27,6],[24,2,24,3],[26,2,26,4],[11,2,11,4],[4,7,12,7],[14,2,14,7],[19,2,19,4],[8,6,12,6],[21,2,21,3]]}
[]
[]
[]
[null,null,"AYSO SECTION 8 AREA C",null,null,{"$f":"'0'!$B$5","v":"TEAM NAME"}]
[null,null,"PLAYER NAME",null,null,"INSERT OR PASTE\nPICTURE HERE",null,{"$f":"'0'!$B$4","v":"1234"}]
[null,null,{"$f":"IF('0'!$A$23<>\"\",'0'!$A$23,\"\")","v":"PLAYER 7"}]
[null,null,"AYSO PLAYER ID#:",null,{"$f":"IF(E8<>\"\",\"JERSEY #\",\"\")","v":"JERSEY #"}]
[null,null,{"$f":"IF('0'!$C$23<>\"\",'0'!$C$23,\"\")","v":11122299},null,{"$f":"IF('0'!$B$23<>\"\",'0'!$B$23,\"\")","v":"8"}]
[null,null,"DATE OF BIRTH:",null,"AGE",null,"REGION"]
[null,null,{"$f":"IF('0'!$D$23<>\"\",'0'!$D$23,\"\")","v":"2001-01-07"},null,{"$f":"IF('0'!$E$23<>\"\",'0'!$E$23,\"\")","v":15}]
[null,null,{"$f":"CHOOSE('0'!$B$6,\"U8\", \"U10\", \"U12\", \"U14\",\"U16\", \"U19\") & \" \" & CHOOSE('0'!$B$7,\"BOYS\",\"GIRLS\",\"COED\")","v":"U8 BOYS"},null,null,null,null,null,null,null,{"$f":"'0'!$B$6","v":1}]
[null,null,"AYSO SEASON:"]
[null,null,{"$f":"'0'!$B$8","v":"MY2015"}]
[null,null,"REGIONAL COMMISSIONER - SIGNATURE WITH RED INK"]
[null,null,{"$f":"'0'!$B$9","v":"COMMISSIONER NAME"}]
[]
[]
[]
[null,null,"AYSO SECTION 8 AREA C",null,null,{"$f":"'0'!$B$5","v":"TEAM NAME"}]
[null,null,"PLAYER NAME",null,null,"INSERT OR PASTE\nPICTURE HERE",null,{"$f":"'0'!$B$4","v":"1234"}]
[null,null,{"$f":"IF('0'!$A$24<>\"\",'0'!$A$24,\"\")","v":"PLAYER 8"}]
[null,null,"AYSO PLAYER ID#:",null,{"$f":"IF(E23<>\"\",\"JERSEY #\",\"\")","v":"JERSEY #"}]
[null,null,{"$f":"IF('0'!$C$24<>\"\",'0'!$C$24,\"\")","v":11122310},null,{"$f":"IF('0'!$B$24<>\"\",'0'!$B$24,\"\")","v":"9"}]
[null,null,"DATE OF BIRTH:",null,"AGE",null,"REGION"]
[null,null,{"$f":"IF('0'!$D$24<>\"\",'0'!$D$24,\"\")","v":"2002-01-08"},null,{"$f":"IF('0'!$E$24<>\"\",'0'!$E$24,\"\")","v":14}]
[null,null,{"$f":"CHOOSE('0'!$B$6,\"U8\", \"U10\", \"U12\", \"U14\",\"U16\", \"U19\") & \" \" & CHOOSE('0'!$B$7,\"BOYS\",\"GIRLS\",\"COED\")","v":"U8 BOYS"},null,null,null,null,null,null,null,{"$f":"'0'!$B$6","v":1}]
[null,null,"AYSO SEASON:"]
[null,null,{"$f":"'0'!$B$8","v":"MY2015"}]
[null,null,"REGIONAL COMMISSIONER - SIGNATURE WITH RED INK"]
[null,null,{"$f":"'0'!$B$9","v":"COMMISSIONER NAME"}]

{"sheet":"6","index":6,"n_rows":30,"n_cols":11,"rows_kept":30,"cut":false,"hidden":false,"merged":[[9,2,9,3],[8,2,8,3],[18,5,18,7],[19,7,27,7],[10,2,10,4],[25,2,25,4],[20,2,20,4],[22,2,22,3],[13,2,13,7],[17,2,17,7],[18,2,18,4],[2,2,2,7],[3,2,3,4],[4,2,4,4],[5,2,5,4],[7,2,7,3],[3,5,3,7],[6,2,6,3],[29,2,29,7],[4,5,12,5],[12,2,12,4],[27,2,27,4],[19,5,27,5],[28,2,28,7],[23,2,23,3],[23,6,27,6],[24,2,24,3],[26,2,26,4],[11,2,11,4],[4,7,12,7],[14,2,14,7],[19,2,19,4],[8,6,12,6],[21,2,21,3]]}
[]
[]
[]
[null,null,"AYSO SECTION 8 AREA C",null,null,{"$f":"'0'!$B$5","v":"TEAM NAME"}]
[null,null,"PLAYER NAME",null,null,"INSERT OR PASTE\nPICTURE HERE",null,{"$f":"'0'!$B$4","v":"1234"}]
[null,null,{"$f":"IF('0'!$A$25<>\"\",'0'!$A$25,\"\")","v":"PLAYER 9"}]
[null,null,"AYSO PLAYER ID#:",null,{"$f":"IF(E8<>\"\",\"JERSEY #\",\"\")","v":"JERSEY #"}]
[null,null,{"$f":"IF('0'!$C$25<>\"\",'0'!$C$25,\"\")","v":11122321},null,{"$f":"IF('0'!$B$25<>\"\",'0'!$B$25,\"\")","v":"10"}]
[null,null,"DATE OF BIRTH:",null,"AGE",null,"REGION"]
[null,null,{"$f":"IF('0'!$D$25<>\"\",'0'!$D$25,\"\")","v":"2003-01-09"},null,{"$f":"IF('0'!$E$25<>\"\",'0'!$E$25,\"\")","v":13}]
[null,null,{"$f":"CHOOSE('0'!$B$6,\"U8\", \"U10\", \"U12\", \"U14\",\"U16\", \"U19\") & \" \" & CHOOSE('0'!$B$7,\"BOYS\",\"GIRLS\",\"COED\")","v":"U8 BOYS"},null,null,null,null,null,null,null,{"$f":"'0'!$B$6","v":1}]
[null,null,"AYSO SEASON:"]
[null,null,{"$f":"'0'!$B$8","v":"MY2015"}]
[null,null,"REGIONAL COMMISSIONER - SIGNATURE WITH RED INK"]
[null,null,{"$f":"'0'!$B$9","v":"COMMISSIONER NAME"}]
[]
[]
[]
[null,null,"AYSO SECTION 8 AREA C",null,null,{"$f":"'0'!$B$5","v":"TEAM NAME"}]
[null,null,"PLAYER NAME",null,null,"INSERT OR PASTE\nPICTURE HERE",null,{"$f":"'0'!$B$4","v":"1234"}]
[null,null,{"$f":"IF('0'!$A$26<>\"\",'0'!$A$26,\"\")","v":"PLAYER 10"}]
[null,null,"AYSO PLAYER ID#:",null,{"$f":"IF(E23<>\"\",\"JERSEY #\",\"\")","v":"JERSEY #"}]
[null,null,{"$f":"IF('0'!$C$26<>\"\",'0'!$C$26,\"\")","v":11122332},null,{"$f":"IF('0'!$B$26<>\"\",'0'!$B$26,\"\")","v":"11"}]
[null,null,"DATE OF BIRTH:",null,"AGE",null,"REGION"]
[null,null,{"$f":"IF('0'!$D$26<>\"\",'0'!$D$26,\"\")","v":"2004-01-10"},null,{"$f":"IF('0'!$E$26<>\"\",'0'!$E$26,\"\")","v":12}]
[null,null,{"$f":"CHOOSE('0'!$B$6,\"U8\", \"U10\", \"U12\", \"U14\",\"U16\", \"U19\") & \" \" & CHOOSE('0'!$B$7,\"BOYS\",\"GIRLS\",\"COED\")","v":"U8 BOYS"},null,null,null,null,null,null,null,{"$f":"'0'!$B$6","v":1}]
[null,null,"AYSO SEASON:"]
[null,null,{"$f":"'0'!$B$8","v":"MY2015"}]
[null,null,"REGIONAL COMMISSIONER - SIGNATURE WITH RED INK"]
[null,null,{"$f":"'0'!$B$9","v":"COMMISSIONER NAME"}]

{"sheet":"7","index":7,"n_rows":30,"n_cols":11,"rows_kept":30,"cut":false,"hidden":false,"merged":[[9,2,9,3],[8,2,8,3],[18,5,18,7],[19,7,27,7],[10,2,10,4],[25,2,25,4],[20,2,20,4],[22,2,22,3],[13,2,13,7],[17,2,17,7],[18,2,18,4],[2,2,2,7],[3,2,3,4],[4,2,4,4],[5,2,5,4],[7,2,7,3],[3,5,3,7],[6,2,6,3],[29,2,29,7],[4,5,12,5],[12,2,12,4],[27,2,27,4],[19,5,27,5],[28,2,28,7],[23,2,23,3],[23,6,27,6],[24,2,24,3],[26,2,26,4],[11,2,11,4],[4,7,12,7],[14,2,14,7],[19,2,19,4],[8,6,12,6],[21,2,21,3]]}
[]
[]
[]
[null,null,"AYSO SECTION 8 AREA C",null,null,{"$f":"'0'!$B$5","v":"TEAM NAME"}]
[null,null,"PLAYER NAME",null,null,"INSERT OR PASTE\nPICTURE HERE",null,{"$f":"'0'!$B$4","v":"1234"}]
[null,null,{"$f":"IF('0'!$A$27<>\"\",'0'!$A$27,\"\")","v":"PLAYER 11"}]
[null,null,"AYSO PLAYER ID#:",null,{"$f":"IF(E8<>\"\",\"JERSEY #\",\"\")","v":"JERSEY #"}]
[null,null,{"$f":"IF('0'!$C$27<>\"\",'0'!$C$27,\"\")","v":11122343},null,{"$f":"IF('0'!$B$27<>\"\",'0'!$B$27,\"\")","v":"12"}]
[null,null,"DATE OF BIRTH:",null,"AGE",null,"REGION"]
[null,null,{"$f":"IF('0'!$D$27<>\"\",'0'!$D$27,\"\")","v":"2005-01-11"},null,{"$f":"IF('0'!$E$27<>\"\",'0'!$E$27,\"\")","v":11}]
[null,null,{"$f":"CHOOSE('0'!$B$6,\"U8\", \"U10\", \"U12\", \"U14\",\"U16\", \"U19\") & \" \" & CHOOSE('0'!$B$7,\"BOYS\",\"GIRLS\",\"COED\")","v":"U8 BOYS"},null,null,null,null,null,null,null,{"$f":"'0'!$B$6","v":1}]
[null,null,"AYSO SEASON:"]
[null,null,{"$f":"'0'!$B$8","v":"MY2015"}]
[null,null,"REGIONAL COMMISSIONER - SIGNATURE WITH RED INK"]
[null,null,{"$f":"'0'!$B$9","v":"COMMISSIONER NAME"}]
[]
[]
[]
[null,null,"AYSO SECTION 8 AREA C",null,null,{"$f":"'0'!$B$5","v":"TEAM NAME"}]
[null,null,"PLAYER NAME",null,null,"INSERT OR PASTE\nPICTURE HERE",null,{"$f":"'0'!$B$4","v":"1234"}]
[null,null,{"$f":"IF('0'!$A$28<>\"\",'0'!$A$28,\"\")","v":"PLAYER 12"}]
[null,null,"AYSO PLAYER ID#:",null,{"$f":"IF(E23<>\"\",\"JERSEY #\",\"\")","v":"JERSEY #"}]
[null,null,{"$f":"IF('0'!$C$28<>\"\",'0'!$C$28,\"\")","v":11122354},null,{"$f":"IF('0'!$B$28<>\"\",'0'!$B$28,\"\")","v":"13"}]
[null,null,"DATE OF BIRTH:",null,"AGE",null,"REGION"]
[null,null,{"$f":"IF('0'!$D$28<>\"\",'0'!$D$28,\"\")","v":"2006-01-12"},null,{"$f":"IF('0'!$E$28<>\"\",'0'!$E$28,\"\")","v":10}]
[null,null,{"$f":"CHOOSE('0'!$B$6,\"U8\", \"U10\", \"U12\", \"U14\",\"U16\", \"U19\") & \" \" & CHOOSE('0'!$B$7,\"BOYS\",\"GIRLS\",\"COED\")","v":"U8 BOYS"},null,null,null,null,null,null,null,{"$f":"'0'!$B$6","v":1}]
[null,null,"AYSO SEASON:"]
[null,null,{"$f":"'0'!$B$8","v":"MY2015"}]
[null,null,"REGIONAL COMMISSIONER - SIGNATURE WITH RED INK"]
[null,null,{"$f":"'0'!$B$9","v":"COMMISSIONER NAME"}]

{"sheet":"8","index":8,"n_rows":30,"n_cols":11,"rows_kept":30,"cut":false,"hidden":false,"merged":[[9,2,9,3],[8,2,8,3],[18,5,18,7],[19,7,27,7],[10,2,10,4],[25,2,25,4],[20,2,20,4],[22,2,22,3],[13,2,13,7],[17,2,17,7],[18,2,18,4],[2,2,2,7],[3,2,3,4],[4,2,4,4],[5,2,5,4],[7,2,7,3],[3,5,3,7],[6,2,6,3],[29,2,29,7],[4,5,12,5],[12,2,12,4],[27,2,27,4],[19,5,27,5],[28,2,28,7],[23,2,23,3],[23,6,27,6],[24,2,24,3],[26,2,26,4],[11,2,11,4],[4,7,12,7],[14,2,14,7],[19,2,19,4],[8,6,12,6],[21,2,21,3]]}
[]
[]
[]
[null,null,"AYSO SECTION 8 AREA C",null,null,{"$f":"'0'!$B$5","v":"TEAM NAME"}]
[null,null,"PLAYER NAME",null,null,"INSERT OR PASTE\nPICTURE HERE",null,{"$f":"'0'!$B$4","v":"1234"}]
[null,null,{"$f":"IF('0'!$A$29<>\"\",'0'!$A$29,\"\")","v":"PLAYER 13"}]
[null,null,"AYSO PLAYER ID#:",null,{"$f":"IF(E8<>\"\",\"JERSEY #\",\"\")","v":"JERSEY #"}]
[null,null,{"$f":"IF('0'!$C$29<>\"\",'0'!$C$29,\"\")","v":11122365},null,{"$f":"IF('0'!$B$29<>\"\",'0'!$B$29,\"\")","v":"14"}]
[null,null,"DATE OF BIRTH:",null,"AGE",null,"REGION"]
[null,null,{"$f":"IF('0'!$D$29<>\"\",'0'!$D$29,\"\")","v":"2007-01-13"},null,{"$f":"IF('0'!$E$29<>\"\",'0'!$E$29,\"\")","v":9}]
[null,null,{"$f":"CHOOSE('0'!$B$6,\"U8\", \"U10\", \"U12\", \"U14\",\"U16\", \"U19\") & \" \" & CHOOSE('0'!$B$7,\"BOYS\",\"GIRLS\",\"COED\")","v":"U8 BOYS"},null,null,null,null,null,null,null,{"$f":"'0'!$B$6","v":1}]
[null,null,"AYSO SEASON:"]
[null,null,{"$f":"'0'!$B$8","v":"MY2015"}]
[null,null,"REGIONAL COMMISSIONER - SIGNATURE WITH RED INK"]
[null,null,{"$f":"'0'!$B$9","v":"COMMISSIONER NAME"}]
[]
[]
[]
[null,null,"AYSO SECTION 8 AREA C",null,null,{"$f":"'0'!$B$5","v":"TEAM NAME"}]
[null,null,"PLAYER NAME",null,null,"INSERT OR PASTE\nPICTURE HERE",null,{"$f":"'0'!$B$4","v":"1234"}]
[null,null,{"$f":"IF('0'!$A$30<>\"\",'0'!$A$30,\"\")","v":"PLAYER 14"}]
[null,null,"AYSO PLAYER ID#:",null,{"$f":"IF(E23<>\"\",\"JERSEY #\",\"\")","v":"JERSEY #"}]
[null,null,{"$f":"IF('0'!$C$30<>\"\",'0'!$C$30,\"\")","v":11122376},null,{"$f":"IF('0'!$B$30<>\"\",'0'!$B$30,\"\")","v":"15"}]
[null,null,"DATE OF BIRTH:",null,"AGE",null,"REGION"]
[null,null,{"$f":"IF('0'!$D$30<>\"\",'0'!$D$30,\"\")","v":"2008-01-14"},null,{"$f":"IF('0'!$E$30<>\"\",'0'!$E$30,\"\")","v":8}]
[null,null,{"$f":"CHOOSE('0'!$B$6,\"U8\", \"U10\", \"U12\", \"U14\",\"U16\", \"U19\") & \" \" & CHOOSE('0'!$B$7,\"BOYS\",\"GIRLS\",\"COED\")","v":"U8 BOYS"},null,null,null,null,null,null,null,{"$f":"'0'!$B$6","v":1}]
[null,null,"AYSO SEASON:"]
[null,null,{"$f":"'0'!$B$8","v":"MY2015"}]
[null,null,"REGIONAL COMMISSIONER - SIGNATURE WITH RED INK"]
[null,null,{"$f":"'0'!$B$9","v":"COMMISSIONER NAME"}]

{"sheet":"9","index":9,"n_rows":30,"n_cols":11,"rows_kept":30,"cut":false,"hidden":false,"merged":[[9,2,9,3],[8,2,8,3],[18,5,18,7],[19,7,27,7],[10,2,10,4],[25,2,25,4],[20,2,20,4],[22,2,22,3],[13,2,13,7],[17,2,17,7],[18,2,18,4],[2,2,2,7],[3,2,3,4],[4,2,4,4],[5,2,5,4],[7,2,7,3],[3,5,3,7],[6,2,6,3],[29,2,29,7],[4,5,12,5],[12,2,12,4],[27,2,27,4],[19,5,27,5],[28,2,28,7],[23,2,23,3],[23,6,27,6],[24,2,24,3],[26,2,26,4],[11,2,11,4],[4,7,12,7],[14,2,14,7],[19,2,19,4],[8,6,12,6],[21,2,21,3]]}
[]
[]
[]
[null,null,"AYSO SECTION 8 AREA C",null,null,{"$f":"'0'!$B$5","v":"TEAM NAME"}]
[null,null,"PLAYER NAME",null,null,"INSERT OR PASTE\nPICTURE HERE",null,{"$f":"'0'!$B$4","v":"1234"}]
[null,null,{"$f":"IF('0'!$A$31<>\"\",'0'!$A$31,\"\")","v":"PLAYER 15"}]
[null,null,"AYSO PLAYER ID#:",null,{"$f":"IF(E8<>\"\",\"JERSEY #\",\"\")","v":"JERSEY #"}]
[null,null,{"$f":"IF('0'!$C$31<>\"\",'0'!$C$31,\"\")","v":11122387},null,{"$f":"IF('0'!$B$31<>\"\",'0'!$B$31,\"\")","v":"16"}]
[null,null,"DATE OF BIRTH:",null,"AGE",null,"REGION"]
[null,null,{"$f":"IF('0'!$D$31<>\"\",'0'!$D$31,\"\")","v":"2009-01-15"},null,{"$f":"IF('0'!$E$31<>\"\",'0'!$E$31,\"\")","v":7}]
[null,null,{"$f":"CHOOSE('0'!$B$6,\"U8\", \"U10\", \"U12\", \"U14\",\"U16\", \"U19\") & \" \" & CHOOSE('0'!$B$7,\"BOYS\",\"GIRLS\",\"COED\")","v":"U8 BOYS"},null,null,null,null,null,null,null,{"$f":"'0'!$B$6","v":1}]
[null,null,"AYSO SEASON:"]
[null,null,{"$f":"'0'!$B$8","v":"MY2015"}]
[null,null,"REGIONAL COMMISSIONER - SIGNATURE WITH RED INK"]
[null,null,{"$f":"'0'!$B$9","v":"COMMISSIONER NAME"}]
[]
[]
[]
[null,null,"AYSO SECTION 8 AREA C",null,null,{"$f":"'0'!$B$5","v":"TEAM NAME"}]
[null,null,"PLAYER NAME",null,null,"INSERT OR PASTE\nPICTURE HERE",null,{"$f":"'0'!$B$4","v":"1234"}]
[null,null,{"$f":"IF('0'!$A$32<>\"\",'0'!$A$32,\"\")","v":"PLAYER 16"}]
[null,null,"AYSO PLAYER ID#:",null,{"$f":"IF(E23<>\"\",\"JERSEY #\",\"\")","v":"JERSEY #"}]
[null,null,{"$f":"IF('0'!$C$32<>\"\",'0'!$C$32,\"\")","v":11122398},null,{"$f":"IF('0'!$B$32<>\"\",'0'!$B$32,\"\")","v":"17"}]
[null,null,"DATE OF BIRTH:",null,"AGE",null,"REGION"]
[null,null,{"$f":"IF('0'!$D$32<>\"\",'0'!$D$32,\"\")","v":"2010-01-16"},null,{"$f":"IF('0'!$E$32<>\"\",'0'!$E$32,\"\")","v":6}]
[null,null,{"$f":"CHOOSE('0'!$B$6,\"U8\", \"U10\", \"U12\", \"U14\",\"U16\", \"U19\") & \" \" & CHOOSE('0'!$B$7,\"BOYS\",\"GIRLS\",\"COED\")","v":"U8 BOYS"},null,null,null,null,null,null,null,{"$f":"'0'!$B$6","v":1}]
[null,null,"AYSO SEASON:"]
[null,null,{"$f":"'0'!$B$8","v":"MY2015"}]
[null,null,"REGIONAL COMMISSIONER - SIGNATURE WITH RED INK"]
[null,null,{"$f":"'0'!$B$9","v":"COMMISSIONER NAME"}]

{"sheet":"10","index":10,"n_rows":30,"n_cols":11,"rows_kept":30,"cut":false,"hidden":false,"merged":[[9,2,9,3],[8,2,8,3],[18,5,18,7],[19,7,27,7],[10,2,10,4],[25,2,25,4],[20,2,20,4],[22,2,22,3],[13,2,13,7],[17,2,17,7],[18,2,18,4],[2,2,2,7],[3,2,3,4],[4,2,4,4],[5,2,5,4],[7,2,7,3],[3,5,3,7],[6,2,6,3],[29,2,29,7],[4,5,12,5],[12,2,12,4],[27,2,27,4],[19,5,27,5],[28,2,28,7],[23,2,23,3],[23,6,27,6],[24,2,24,3],[26,2,26,4],[11,2,11,4],[4,7,12,7],[14,2,14,7],[19,2,19,4],[8,6,12,6],[21,2,21,3]]}
[]
[]
[]
[null,null,"AYSO SECTION 8 AREA C",null,null,{"$f":"'0'!$B$5","v":"TEAM NAME"}]
[null,null,"PLAYER NAME",null,null,"INSERT OR PASTE\nPICTURE HERE",null,{"$f":"'0'!$B$4","v":"1234"}]
[null,null,{"$f":"IF('0'!$A$33<>\"\",'0'!$A$33,\"\")","v":"PLAYER 17"}]
[null,null,"AYSO PLAYER ID#:",null,{"$f":"IF(E8<>\"\",\"JERSEY #\",\"\")","v":"JERSEY #"}]
[null,null,{"$f":"IF('0'!$C$33<>\"\",'0'!$C$33,\"\")","v":11122409},null,{"$f":"IF('0'!$B$33<>\"\",'0'!$B$33,\"\")","v":"18"}]
[null,null,"DATE OF BIRTH:",null,"AGE",null,"REGION"]
[null,null,{"$f":"IF('0'!$D$33<>\"\",'0'!$D$33,\"\")","v":"2011-01-17"},null,{"$f":"IF('0'!$E$33<>\"\",'0'!$E$33,\"\")","v":5}]
[null,null,{"$f":"CHOOSE('0'!$B$6,\"U8\", \"U10\", \"U12\", \"U14\",\"U16\", \"U19\") & \" \" & CHOOSE('0'!$B$7,\"BOYS\",\"GIRLS\",\"COED\")","v":"U8 BOYS"},null,null,null,null,null,null,null,{"$f":"'0'!$B$6","v":1}]
[null,null,"AYSO SEASON:"]
[null,null,{"$f":"'0'!$B$8","v":"MY2015"}]
[null,null,"REGIONAL COMMISSIONER - SIGNATURE WITH RED INK"]
[null,null,{"$f":"'0'!$B$9","v":"COMMISSIONER NAME"}]
[]
[]
[]
[null,null,"AYSO SECTION 8 AREA C",null,null,{"$f":"'0'!$B$5","v":"TEAM NAME"}]
[null,null,"PLAYER NAME",null,null,"INSERT OR PASTE\nPICTURE HERE",null,{"$f":"'0'!$B$4","v":"1234"}]
[null,null,{"$f":"IF('0'!$A$34<>\"\",'0'!$A$34,\"\")","v":"PLAYER 18"}]
[null,null,"AYSO PLAYER ID#:",null,{"$f":"IF(E23<>\"\",\"JERSEY #\",\"\")","v":"JERSEY #"}]
[null,null,{"$f":"IF('0'!$C$34<>\"\",'0'!$C$34,\"\")","v":11122420},null,{"$f":"IF('0'!$B$34<>\"\",'0'!$B$34,\"\")","v":"19"}]
[null,null,"DATE OF BIRTH:",null,"AGE",null,"REGION"]
[null,null,{"$f":"IF('0'!$D$34<>\"\",'0'!$D$34,\"\")","v":"2012-01-18"},null,{"$f":"IF('0'!$E$34<>\"\",'0'!$E$34,\"\")","v":4}]
[null,null,{"$f":"CHOOSE('0'!$B$6,\"U8\", \"U10\", \"U12\", \"U14\",\"U16\", \"U19\") & \" \" & CHOOSE('0'!$B$7,\"BOYS\",\"GIRLS\",\"COED\")","v":"U8 BOYS"},null,null,null,null,null,null,null,{"$f":"'0'!$B$6","v":1}]
[null,null,"AYSO SEASON:"]
[null,null,{"$f":"'0'!$B$8","v":"MY2015"}]
[null,null,"REGIONAL COMMISSIONER - SIGNATURE WITH RED INK"]
[null,null,{"$f":"'0'!$B$9","v":"COMMISSIONER NAME"}]

{"sheet":"11","index":11,"n_rows":30,"n_cols":11,"rows_kept":30,"cut":false,"hidden":false,"merged":[[9,2,9,3],[8,2,8,3],[18,5,18,7],[19,7,27,7],[10,2,10,4],[25,2,25,4],[20,2,20,4],[22,2,22,3],[13,2,13,7],[17,2,17,7],[18,2,18,4],[2,2,2,7],[3,2,3,4],[4,2,4,4],[5,2,5,4],[7,2,7,3],[3,5,3,7],[6,2,6,3],[29,2,29,7],[4,5,12,5],[12,2,12,4],[27,2,27,4],[19,5,27,5],[28,2,28,7],[23,2,23,3],[23,6,27,6],[24,2,24,3],[26,2,26,4],[11,2,11,4],[4,7,12,7],[14,2,14,7],[19,2,19,4],[8,6,12,6],[21,2,21,3]]}
[]
[]
[]
[null,null,"AYSO SECTION 8 AREA C",null,null,{"$f":"'0'!$B$5","v":"TEAM NAME"}]
[null,null,"PLAYER NAME",null,null,"INSERT OR PASTE\nPICTURE HERE",null,{"$f":"'0'!$B$4","v":"1234"}]
[null,null,{"$f":"IF('0'!$A$35<>\"\",'0'!$A$35,\"\")","v":"PLAYER 19"}]
[null,null,"AYSO PLAYER ID#:",null,{"$f":"IF(E8<>\"\",\"JERSEY #\",\"\")","v":"JERSEY #"}]
[null,null,{"$f":"IF('0'!$C$35<>\"\",'0'!$C$35,\"\")","v":11122431},null,{"$f":"IF('0'!$B$35<>\"\",'0'!$B$35,\"\")","v":"20"}]
[null,null,"DATE OF BIRTH:",null,"AGE",null,"REGION"]
[null,null,{"$f":"IF('0'!$D$35<>\"\",'0'!$D$35,\"\")","v":"2013-01-19"},null,{"$f":"IF('0'!$E$35<>\"\",'0'!$E$35,\"\")","v":3}]
[null,null,{"$f":"CHOOSE('0'!$B$6,\"U8\", \"U10\", \"U12\", \"U14\",\"U16\", \"U19\") & \" \" & CHOOSE('0'!$B$7,\"BOYS\",\"GIRLS\",\"COED\")","v":"U8 BOYS"},null,null,null,null,null,null,null,{"$f":"'0'!$B$6","v":1}]
[null,null,"AYSO SEASON:"]
[null,null,{"$f":"'0'!$B$8","v":"MY2015"}]
[null,null,"REGIONAL COMMISSIONER - SIGNATURE WITH RED INK"]
[null,null,{"$f":"'0'!$B$9","v":"COMMISSIONER NAME"}]
[]
[]
[]
[null,null,"AYSO SECTION 8 AREA C",null,null,{"$f":"'0'!$B$5","v":"TEAM NAME"}]
[null,null,"PLAYER NAME",null,null,"INSERT OR PASTE\nPICTURE HERE",null,{"$f":"'0'!$B$4","v":"1234"}]
[null,null,{"$f":"IF('0'!$A$36<>\"\",'0'!$A$36,\"\")","v":"PLAYER 20"}]
[null,null,"AYSO PLAYER ID#:",null,{"$f":"IF(E23<>\"\",\"JERSEY #\",\"\")","v":"JERSEY #"}]
[null,null,{"$f":"IF('0'!$C$36<>\"\",'0'!$C$36,\"\")","v":11122442},null,{"$f":"IF('0'!$B$36<>\"\",'0'!$B$36,\"\")","v":"21"}]
[null,null,"DATE OF BIRTH:",null,"AGE",null,"REGION"]
[null,null,{"$f":"IF('0'!$D$36<>\"\",'0'!$D$36,\"\")","v":"2014-01-20"},null,{"$f":"IF('0'!$E$36<>\"\",'0'!$E$36,\"\")","v":2}]
[null,null,{"$f":"CHOOSE('0'!$B$6,\"U8\", \"U10\", \"U12\", \"U14\",\"U16\", \"U19\") & \" \" & CHOOSE('0'!$B$7,\"BOYS\",\"GIRLS\",\"COED\")","v":"U8 BOYS"},null,null,null,null,null,null,null,{"$f":"'0'!$B$6","v":1}]
[null,null,"AYSO SEASON:"]
[null,null,{"$f":"'0'!$B$8","v":"MY2015"}]
[null,null,"REGIONAL COMMISSIONER - SIGNATURE WITH RED INK"]
[null,null,{"$f":"'0'!$B$9","v":"COMMISSIONER NAME"}]

{"sheet":"12","index":12,"n_rows":30,"n_cols":11,"rows_kept":30,"cut":false,"hidden":false,"merged":[[9,2,9,3],[8,2,8,3],[18,5,18,7],[19,7,27,7],[10,2,10,4],[25,2,25,4],[20,2,20,4],[22,2,22,3],[13,2,13,7],[17,2,17,7],[18,2,18,4],[2,2,2,7],[3,2,3,4],[4,2,4,4],[5,2,5,4],[7,2,7,3],[3,5,3,7],[6,2,6,3],[29,2,29,7],[4,5,12,5],[12,2,12,4],[27,2,27,4],[19,5,27,5],[28,2,28,7],[23,2,23,3],[23,6,27,6],[24,2,24,3],[26,2,26,4],[11,2,11,4],[4,7,12,7],[14,2,14,7],[19,2,19,4],[8,6,12,6],[21,2,21,3]]}
[]
[]
[]
[null,null,"AYSO SECTION 8 AREA C",null,null,{"$f":"'0'!$B$5","v":"TEAM NAME"}]
[null,null,"PLAYER NAME",null,null,"INSERT OR PASTE\nPICTURE HERE",null,{"$f":"'0'!$B$4","v":"1234"}]
[null,null,{"$f":"IF('0'!$A$37<>\"\",'0'!$A$37,\"\")","v":"PLAYER 21"}]
[null,null,"AYSO PLAYER ID#:",null,{"$f":"IF(E8<>\"\",\"JERSEY #\",\"\")","v":"JERSEY #"}]
[null,null,{"$f":"IF('0'!$C$37<>\"\",'0'!$C$37,\"\")","v":11122453},null,{"$f":"IF('0'!$B$37<>\"\",'0'!$B$37,\"\")","v":"22"}]
[null,null,"DATE OF BIRTH:",null,"AGE",null,"REGION"]
[null,null,{"$f":"IF('0'!$D$37<>\"\",'0'!$D$37,\"\")","v":"2015-01-21"},null,{"$f":"IF('0'!$E$37<>\"\",'0'!$E$37,\"\")","v":1}]
[null,null,{"$f":"CHOOSE('0'!$B$6,\"U8\", \"U10\", \"U12\", \"U14\",\"U16\", \"U19\") & \" \" & CHOOSE('0'!$B$7,\"BOYS\",\"GIRLS\",\"COED\")","v":"U8 BOYS"},null,null,null,null,null,null,null,{"$f":"'0'!$B$6","v":1}]
[null,null,"AYSO SEASON:"]
[null,null,{"$f":"'0'!$B$8","v":"MY2015"}]
[null,null,"REGIONAL COMMISSIONER - SIGNATURE WITH RED INK"]
[null,null,{"$f":"'0'!$B$9","v":"COMMISSIONER NAME"}]
[]
[]
[]
[null,null,"AYSO SECTION 8 AREA C",null,null,{"$f":"'0'!$B$5","v":"TEAM NAME"}]
[null,null,"PLAYER NAME",null,null,"INSERT OR PASTE\nPICTURE HERE",null,{"$f":"'0'!$B$4","v":"1234"}]
[null,null,{"$f":"IF('0'!$A$38<>\"\",'0'!$A$38,\"\")","v":"PLAYER 22"}]
[null,null,"AYSO PLAYER ID#:",null,{"$f":"IF(E23<>\"\",\"JERSEY #\",\"\")","v":"JERSEY #"}]
[null,null,{"$f":"IF('0'!$C$38<>\"\",'0'!$C$38,\"\")","v":11122464},null,{"$f":"IF('0'!$B$38<>\"\",'0'!$B$38,\"\")","v":"23"}]
[null,null,"DATE OF BIRTH:",null,"AGE",null,"REGION"]
[null,null,{"$f":"IF('0'!$D$38<>\"\",'0'!$D$38,\"\")","v":"2016-01-22"},null,{"$f":"IF('0'!$E$38<>\"\",'0'!$E$38,\"\")","v":0}]
[null,null,{"$f":"CHOOSE('0'!$B$6,\"U8\", \"U10\", \"U12\", \"U14\",\"U16\", \"U19\") & \" \" & CHOOSE('0'!$B$7,\"BOYS\",\"GIRLS\",\"COED\")","v":"U8 BOYS"},null,null,null,null,null,null,null,{"$f":"'0'!$B$6","v":1}]
[null,null,"AYSO SEASON:"]
[null,null,{"$f":"'0'!$B$8","v":"MY2015"}]
[null,null,"REGIONAL COMMISSIONER - SIGNATURE WITH RED INK"]
[null,null,{"$f":"'0'!$B$9","v":"COMMISSIONER NAME"}]

{"sheet":"FRONT","index":13,"n_rows":41,"n_cols":33,"rows_kept":41,"cut":false,"hidden":false,"merged":[[39,24,39,29],[39,30,40,32],[40,1,40,2],[40,3,40,5],[40,6,40,11],[40,19,40,20],[40,21,40,23],[40,24,40,29],[39,1,39,2],[39,3,39,5],[39,6,39,11],[39,12,40,14],[39,19,39,20],[39,21,39,23],[35,6,35,11],[35,19,35,20],[35,21,35,23],[35,24,35,29],[37,24,37,29],[37,30,38,32],[38,1,38,2],[38,3,38,5],[38,6,38,11],[38,19,38,20],[38,21,38,23],[38,24,38,29],[37,1,37,2],[37,3,37,5],[37,6,37,11],[37,12,38,14],[37,19,37,20],[37,21,37,23],[33,24,33,29],[33,30,33,32],[34,1,34,2],[34,3,34,5],[34,6,34,11],[34,12,36,14],[34,19,34,20],[34,21,34,23],[34,24,34,29],[34,30,36,32],[33,1,33,2],[33,3,33,5],[33,6,33,11],[33,12,33,14],[33,19,33,20],[33,21,33,23],[36,1,36,2],[36,3,36,5],[36,6,36,11],[36,19,36,20],[36,21,36,23],[36,24,36,29],[35,1,35,2],[35,3,35,5],[29,2,29,7],[29,20,29,25],[30,2,30,7],[30,20,30,25],[31,1,32,14],[31,19,32,32],[22,2,22,7],[22,20,22,25],[23,2,23,7],[23,20,23,25],[24,2,24,7],[24,20,24,25],[27,2,27,7],[27,20,27,25],[26,2,26,7],[26,20,26,25],[25,2,25,7],[25,20,25,25],[28,2,28,7],[28,20,28,25],[19,2,19,7],[19,20,19,25],[20,2,20,7],[20,20,20,25],[21,2,21,7],[21,20,21,25],[16,2,16,7],[16,20,16,25],[17,2,17,7],[17,20,17,25],[18,2,18,7],[18,20,18,25],[13,2,13,7],[13,20,13,25],[14,2,14,7],[14,20,14,25],[15,2,15,7],[15,20,15,25],[10,2,10,7],[10,20,10,25],[11,2,11,7],[11,20,11,25],[12,2,12,7],[12,20,12,25],[7,27,7,28],[7,29,7,32],[8,9,8,10],[8,27,8,28],[9,2,9,7],[9,20,9,25],[6,1,6,14],[6,19,6,32],[7,1,8,1],[7,2,8,7],[7,8,8,8],[7,9,7,10],[7,11,7,14],[7,19,8,19],[7,20,8,25],[7,26,8,26],[3,24,3,26],[3,27,3,32],[4,1,4,3],[4,4,4,5],[4,6,4,8],[4,9,4,14],[4,19,4,21],[4,22,4,23],[4,24,4,26],[4,27,4,32],[3,1,3,3],[3,4,3,5],[3,6,3,8],[3,9,3,14],[3,19,3,21],[3,22,3,23],[1,1,1,14],[1,19,1,32],[2,6,2,7],[2,8,2,9],[2,10,2,11],[2,12,2,14],[2,24,2,25],[2,26,2,27],[2,28,2,29],[2,30,2,32]]}
[]
[null,"OFFICIAL GAME CARD",null,null,null,null,null,null,null,null,null,null,null,null,null,null,null,null,null,"OFFICIAL GAME CARD"]
[null,"REGION",null,{"$f":"'0'!B4","v":"1234"},"AGE GROUP",{"$f":"CHOOSE('0'!B6,\"U8\",\"U10\",\"U12\",\"U14\")","v":"U8"},"TEAM #",null,null,null,"DATE",null,null,null,null,null,null,null,null,"REGION",null,{"$f":"D3","v":"1234"},"AGE GROUP",{"$f":"F3","v":"U8"},"TEAM #",null,{"$f":"I3","v":0},null,"DATE",null,{"$f":"M3","v":"00:00:00"}]
[null,"TEAM NAME",null,null,{"$f":"'0'!$B$5","v":"TEAM NAME"},null,"OPPOSING TEAM",null,null,null,null,null,null,null,null,null,null,null,null,"TEAM NAME",null,null,{"$f":"E4","v":"TEAM NAME"},null,"OPPOSING TEAM",null,null,{"$f":"J4","v":0}]
[null,"COACH NAME:",null,null,{"$f":"'0'!$B$12","v":"HEAD COACH"},null,"ASST. COACH NAME:",null,null,{"$f":"'0'!$B$13","v":"ASST COACH"},null,null,null,null,null,null,null,null,null,"COACH NAME:",null,null,{"$f":"E5","v":"HEAD COACH"},null,"ASST. COACH NAME:",null,null,{"$f":"J5","v":"ASST COACH"}]
[]
[null,"All team players must be listed in order by Jersey #. If absent, indicate reason.",null,null,null,null,null,null,null,null,null,null,null,null,null,null,null,null,null,"All team players must be listed in order by Jersey #. If absent, indicate reason."]
[null,"No.","PRINT PLAYERS NAME",null,null,null,null,null,"♦","Goals",null,"Qtrs. Played",null,null,null,null,null,null,null,"No.","PRINT PLAYERS NAME",null,null,null,null,null,"♦","Goals",null,"Qtrs. Played"]
[null,null,null,null,null,null,null,null,null,"Scored",null,1,2,3,4,null,null,null,null,null,null,null,null,null,null,null,null,"Scored",null,1,2,3,4]
[null,{"$f":"'0'!B17","v":"2"},{"$f":"'0'!A17","v":"PLAYER 1"},null,null,null,null,null,null,null,null,null,null,null,null,null,null,null,null,{"$f":"B10","v":"2"},{"$f":"C10","v":"PLAYER 1"},null,null,null,null,null,{"$f":"I10","v":0}]
[null,{"$f":"'0'!B18","v":"3"},{"$f":"'0'!A18","v":"PLAYER 2"},null,null,null,null,null,null,null,null,null,null,null,null,null,null,null,null,{"$f":"B11","v":"3"},{"$f":"C11","v":"PLAYER 2"},null,null,null,null,null,{"$f":"I11","v":0}]
[null,{"$f":"'0'!B19","v":"4"},{"$f":"'0'!A19","v":"PLAYER 3"},null,null,null,null,null,null,null,null,null,null,null,null,null,null,null,null,{"$f":"B12","v":"4"},"PLAYER 3",null,null,null,null,null,0]
[null,{"$f":"'0'!B20","v":"5"},{"$f":"'0'!A20","v":"PLAYER 4"},null,null,null,null,null,null,null,null,null,null,null,null,null,null,null,null,"5","PLAYER 4",null,null,null,null,null,0]
[null,{"$f":"'0'!B21","v":"6"},{"$f":"'0'!A21","v":"PLAYER 5"},null,null,null,null,null,null,null,null,null,null,null,null,null,null,null,null,"6","PLAYER 5",null,null,null,null,null,0]
[null,{"$f":"'0'!B22","v":"7"},{"$f":"'0'!A22","v":"PLAYER 6"},null,null,null,null,null,null,null,null,null,null,null,null,null,null,null,null,"7","PLAYER 6",null,null,null,null,null,0]
[null,{"$f":"'0'!B23","v":"8"},{"$f":"'0'!A23","v":"PLAYER 7"},null,null,null,null,null,null,null,null,null,null,null,null,null,null,null,null,"8","PLAYER 7",null,null,null,null,null,0]
[null,{"$f":"'0'!B24","v":"9"},{"$f":"'0'!A24","v":"PLAYER 8"},null,null,null,null,null,null,null,null,null,null,null,null,null,null,null,null,"9","PLAYER 8",null,null,null,null,null,0]
[null,{"$f":"'0'!B25","v":"10"},{"$f":"'0'!A25","v":"PLAYER 9"},null,null,null,null,null,null,null,null,null,null,null,null,null,null,null,null,"10","PLAYER 9",null,null,null,null,null,0]
[null,{"$f":"'0'!B26","v":"11"},{"$f":"'0'!A26","v":"PLAYER 10"},null,null,null,null,null,null,null,null,null,null,null,null,null,null,null,null,"11","PLAYER 10",null,null,null,null,null,0]
[null,{"$f":"'0'!B27","v":"12"},{"$f":"'0'!A27","v":"PLAYER 11"},null,null,null,null,null,null,null,null,null,null,null,null,null,null,null,null,"12","PLAYER 11",null,null,null,null,null,0]
[null,{"$f":"'0'!B28","v":"13"},{"$f":"'0'!A28","v":"PLAYER 12"},null,null,null,null,null,null,null,null,null,null,null,null,null,null,null,null,"13","PLAYER 12",null,null,null,null,null,0]
[null,{"$f":"'0'!B29","v":"14"},{"$f":"'0'!A29","v":"PLAYER 13"},null,null,null,null,null,null,null,null,null,null,null,null,null,null,null,null,"14","PLAYER 13",null,null,null,null,null,0]
[null,{"$f":"'0'!B30","v":"15"},{"$f":"'0'!A30","v":"PLAYER 14"},null,null,null,null,null,null,null,null,null,null,null,null,null,null,null,null,"15","PLAYER 14",null,null,null,null,null,0]
[null,{"$f":"'0'!B31","v":"16"},{"$f":"'0'!A31","v":"PLAYER 15"},null,null,null,null,null,null,null,null,null,null,null,null,null,null,null,null,"16","PLAYER 15",null,null,null,null,null,0]
[null,{"$f":"'0'!B32","v":"17"},{"$f":"'0'!A32","v":"PLAYER 16"},null,null,null,null,null,null,null,null,null,null,null,null,null,null,null,null,"17","PLAYER 16",null,null,null,null,null,0]
[null,{"$f":"'0'!B33","v":"18"},{"$f":"'0'!A33","v":"PLAYER 17"},null,null,null,null,null,null,null,null,null,null,null,null,null,null,null,null,{"$f":"B26","v":"18"},{"$f":"C26","v":"PLAYER 17"},null,null,null,null,null,{"$f":"I26","v":0}]
[null,{"$f":"'0'!B34","v":"19"},{"$f":"'0'!A34","v":"PLAYER 18"},null,null,null,null,null,null,null,null,null,null,null,null,null,null,null,null,"19","PLAYER 18",null,null,null,null,null,0]
[null,{"$f":"'0'!B35","v":"20"},{"$f":"'0'!A35","v":"PLAYER 19"},null,null,null,null,null,null,null,null,null,null,null,null,null,null,null,null,{"$f":"B28","v":"20"},{"$f":"C28","v":"PLAYER 19"},null,null,null,null,null,{"$f":"I28","v":0}]
[null,{"$f":"'0'!B35","v":"20"},{"$f":"'0'!A36","v":"PLAYER 20"},null,null,null,null,null,null,null,null,null,null,null,null,null,null,null,null,"20","PLAYER 20",null,null,null,null,null,0]
[null,{"$f":"'0'!B36","v":"21"},{"$f":"'0'!A37","v":"PLAYER 21"},null,null,null,null,null,null,null,null,null,null,null,null,null,null,null,null,"21","PLAYER 21",null,null,null,null,null,0]
[null,{"$f":"'0'!B37","v":"22"},{"$f":"'0'!A38","v":"PLAYER 22"},null,null,null,null,null,null,null,null,null,null,null,null,null,null,null,null,{"$f":"B31","v":"22"},{"$f":"C31","v":"PLAYER 22"},null,null,null,null,null,0]
[null,"♦ Indicate: GK - goalkeeper; C - Captain; A - Alternate Captain\nAll players on roster must be listed; indicate reason for absence",null,null,null,null,null,null,null,null,null,null,null,null,null,null,null,null,null,"♦ Indicate: GK - goalkeeper; C - Captain; A - Alternate Captain\nAll players on roster must be listed; indicate reason for absence"]
[]
[null,"AGE\nGROUP",null,"EACH HALF\nNOT TO EXCEED",null,null,"DURATION OF GAME\nNOT TO EXCEED",null,null,null,null,null,"BALL SIZE",null,null,null,null,null,null,"AGE\nGROUP",null,"EACH HALF\nNOT TO EXCEED",null,null,"DURATION OF GAME\nNOT TO EXCEED",null,null,null,null,null,"BALL SIZE"]
[null,"U-19",null,"45 Minutes",null,null,"90 Minutes",null,null,null,null,null,"SIZE 5",null,null,null,null,null,null,"U-19",null,"45 Minutes",null,null,"90 Minutes",null,null,null,null,null,"SIZE 5"]
[null,"U-16",null,"40 Minutes",null,null,"80 Minutes",null,null,null,null,null,null,null,null,null,null,null,null,"U-16",null,"40 Minutes",null,null,"80 Minutes"]
[null,"U-14",null,"35 Minutes",null,null,"70 Minutes",null,null,null,null,null,null,null,null,null,null,null,null,"U-14",null,"35 Minutes",null,null,"70 Minutes"]
[null,"U-12",null,"30 Minutes",null,null,"60 Minutes",null,null,null,null,null,"SIZE 4",null,null,null,null,null,null,"U-12",null,"30 Minutes",null,null,"60 Minutes",null,null,null,null,null,"SIZE 4"]
[null,"U-10",null,"25 Minutes",null,null,"50 Minutes",null,null,null,null,null,null,null,null,null,null,null,null,"U-10",null,"25 Minutes",null,null,"50 Minutes"]
[null,"U-8",null,"20 Minutes",null,null,"40 Minutes",null,null,null,null,null,"SIZE 3",null,null,null,null,null,null,"U-8",null,"20 Minutes",null,null,"40 Minutes",null,null,null,null,null,"SIZE 3"]
[null,"U-6",null,"20 Minutes (10 min recommended)",null,null,"40 Minutes (20 min recommended)",null,null,null,null,null,null,null,null,null,null,null,null,"U-6",null,"20 Minutes (10 min recommended)",null,null,"40 Minutes (20 min recommended)"]

{"sheet":"BACK","index":14,"n_rows":43,"n_cols":31,"rows_kept":43,"cut":false,"hidden":false,"merged":[[41,1,41,6],[41,7,41,16],[41,19,41,24],[41,25,41,34],[42,1,42,6],[42,7,42,16],[42,19,42,24],[42,25,42,34],[38,1,38,16],[38,19,38,34],[39,1,39,16],[39,19,39,34],[40,1,40,6],[40,7,40,16],[40,19,40,24],[40,25,40,34],[35,1,35,16],[35,19,35,34],[36,1,36,16],[36,19,36,34],[37,1,37,16],[37,19,37,34],[32,1,32,16],[32,19,32,34],[33,1,33,16],[33,19,33,34],[34,1,34,16],[34,19,34,34],[29,1,29,16],[29,19,29,34],[30,1,30,16],[30,19,30,34],[31,1,31,16],[31,19,31,34],[26,1,26,16],[26,19,26,34],[27,1,27,16],[27,19,27,34],[28,1,28,16],[28,19,28,34],[23,1,23,16],[23,19,23,34],[24,1,24,16],[24,19,24,34],[25,1,25,16],[25,19,25,34],[20,1,20,16],[20,19,20,34],[21,1,21,16],[21,19,21,34],[22,1,22,16],[22,19,22,34],[17,27,17,28],[17,29,17,34],[18,1,18,16],[18,19,18,34],[19,1,19,16],[19,19,19,34],[17,1,17,3],[17,4,17,8],[17,9,17,10],[17,11,17,16],[17,19,17,21],[17,22,17,26],[15,27,15,28],[15,29,15,34],[16,1,16,3],[16,4,16,8],[16,9,16,10],[16,11,16,16],[16,19,16,21],[16,22,16,26],[16,27,16,28],[16,29,16,34],[15,1,15,3],[15,4,15,8],[15,9,15,10],[15,11,15,16],[15,19,15,21],[15,22,15,26],[13,4,13,5],[13,7,13,8],[13,9,13,16],[13,22,13,23],[13,25,13,26],[13,27,13,34],[11,25,11,26],[11,27,11,34],[12,1,12,3],[12,4,12,5],[12,7,12,8],[12,9,12,16],[12,19,12,21],[12,22,12,23],[12,25,12,26],[12,27,12,34],[11,1,11,3],[11,4,11,5],[11,7,11,8],[11,9,11,16],[11,19,11,21],[11,22,11,23],[5,28,5,29],[5,33,5,34],[7,1,7,16],[7,19,7,34],[9,4,9,5],[9,7,9,8],[9,22,9,23],[9,25,9,26],[5,4,5,5],[5,6,5,7],[5,10,5,11],[5,15,5,16],[5,22,5,23],[5,24,5,25],[4,5,4,6],[4,8,4,10],[4,11,4,16],[4,23,4,24],[4,26,4,28],[4,29,4,34],[2,1,2,16],[2,19,2,34],[3,2,3,4],[3,13,3,16],[3,20,3,22],[3,31,3,34]]}
[]
[]
[null,"All AYSO games shall be conducted in accorance with the current FIFA Laws Of The Game and decisions of the International Board in effect at a date specified by the Area Director for his/her area (approximately the time of team formation for a given season), with the exceptions detailed in the AYSO National Rules and Regulations.",null,null,null,null,null,null,null,null,null,null,null,null,null,null,null,null,null,"All AYSO games shall be conducted in accorance with the current FIFA Laws Of The Game and decisions of the International Board in effect at a date specified by the Area Director for his/her area (approximately the time of team formation for a given season), with the exceptions detailed in the AYSO National Rules and Regulations."]
[null,"DATE",{"$f":"FRONT!AE3","v":"00:00:00"},null,null,"TIME",null,"FIELD",null,null,"CONDITIONS",null,null,null,null,null,null,null,null,"DATE",{"$f":"FRONT!M3","v":"00:00:00"},null,null,"TIME",null,"FIELD",null,null,"CONDITIONS"]
[null,"HOME TEAM COLORS",null,null,null,null,null,null,"VISITING TEAM COLORS",null,null,null,null,null,null,null,null,null,null,"HOME TEAM COLORS",null,null,null,{"$f":"F5","v":0},null,null,"VISITING TEAM COLORS"]
[null,"HALFTIME SCORE",null,null,null,null,"IN FAVOR OF",null,null,"FINAL SCORE",null,null,"WINNING TEAM",null,null,null,null,null,null,"HALFTIME SCORE",null,null,null,null,"IN FAVOR OF",null,null,"FINAL SCORE",null,null,"WINNING TEAM"]
[]
[null,"Overall Conduct & Sporting Behavior",null,null,null,null,null,null,null,null,null,null,null,null,null,null,null,null,null,"Overall Conduct & Sporting Behavior"]
[]
[null,null,null,null,"Excellent",null,"Normal","Poor",null,"Additional Comments",null,null,null,null,null,null,null,null,null,null,null,null,"Excellent",null,"Normal","Poor",null,"Additional Comments"]
[]
[null,"PLAYERS",null,null,null,null,null,null,null,null,null,null,null,null,null,null,null,null,null,"PLAYERS"]
[null,"COACHES",null,null,null,null,null,null,null,null,null,null,null,null,null,null,null,null,null,"COACHES"]
[null,"SPECTATORS",null,null,null,null,null,null,null,null,null,null,null,null,null,null,null,null,null,"SPECTATORS"]
[]
[null,"REFEREE NAME:",null,null,null,null,null,null,null,"PHONE / EMAIL",null,null,null,null,null,null,null,null,null,"REFEREE NAME:",null,null,null,null,null,null,null,"PHONE / EMAIL"]
[null,"1ST AR NAME",null,null,null,null,null,null,null,"PHONE / EMAIL",null,null,null,null,null,null,null,null,null,"1ST AR NAME",null,null,null,null,null,null,null,"PHONE / EMAIL"]
[null,"2ND AR NAME",null,null,null,null,null,null,null,"PHONE / EMAIL",null,null,null,null,null,null,null,null,null,"2ND AR NAME",null,null,null,null,null,null,null,"PHONE / EMAIL"]
[null,"Preliminary Incident Report",null,null,null,null,null,null,null,null,null,null,null,null,null,null,null,null,null,"Preliminary Incident Report"]
[null,"(A more detailed report may be required - Check with your local Administrator)",null,null,null,null,null,null,null,null,null,null,null,null,null,null,null,null,null,"(A more detailed report may be required - Check with your local Administrator)"]
[null,"Disciplinary Action / Significant Injuries / Additional Comments: Please include names and player numbers.",null,null,null,null,null,null,null,null,null,null,null,null,null,null,null,null,null,"Disciplinary Action / Significant Injuries / Additional Comments: Please include names and player numbers."]
[]
[]
[]
[]
[]
[]
[]
[]
[]
[]
[]
[]
[]
[]
[]
[]
[]
[]
[null,"Signatures only needed if additional information is included in the Preliminary Incident Report",null,null,null,null,null,null,null,null,null,null,null,null,null,null,null,null,null,"Signatures only needed if additional information is included in the Preliminary Incident Report"]
[null,"CENTER REFEREE SIGNATURE",null,null,null,null,null,null,null,null,null,null,null,null,null,null,null,null,null,"CENTER REFEREE SIGNATURE"]
[null,"1ST ASSISTANT REFEREE SIGNATURE",null,null,null,null,null,null,null,null,null,null,null,null,null,null,null,null,null,"1ST ASSISTANT REFEREE SIGNATURE"]
[null,"2ND ASSISTANT REFEREE SIGNATURE",null,null,null,null,null,null,null,null,null,null,null,null,null,null,null,null,null,"2ND ASSISTANT REFEREE SIGNATURE"]

{"sheet":"PIC","index":15,"n_rows":0,"n_cols":0,"rows_kept":0,"cut":false,"hidden":true,"merged":[]}